Public
Snippet $121 authored by Ivan Tyagov

tutorial

1 2 3 4 5 6 7 8 9 10 11 12 13 14 15 16 17 18 19 20 21 22 23 24 25 26 27 28 29 30 31 32 33 34 35 36 37 38 39 40 41 42 43 44 45 46 47 48 49 50 51 52 53 54 55 56 57 58 59 60 61 62 63 64 65 66 67 68 69 70 71 72 73 74 75 76 77 78 79 80 81 82 83 84 85 86 87 88 89 90 91 92 93 94 95 96 97 98 99 100 101 102 103 104 105 106 107 108 109 110 111 112 113 114 115 116 117 118 119 120 121 122 123 124 125 126 127 128 129 130 131 132 133 134 135 136 137 138 139 140 141 142 143 144 145 146 147 148 149 150 151 152 153 154 155 156 157 158 159 160 161 162 163 164 165 166 167 168 169 170 171 172 173 174 175 176 177 178 179 180 181 182 183 184 185 186 187 188 189 190 191 192 193 194 195 196 197 198 199 200 201 202 203 204 205 206 207 208 209 210 211 212 213 214 215 216 217 218 219 220 221 222 223 224 225 226 227 228 229 230 231 232 233 234 235 236 237 238 239 240 241 242 243 244 245 246 247 248 249 250 251 252 253 254 255 256 257 258 259 260 261 262 263 264 265 266 267 268 269 270 271 272 273 274 275 276 277 278 279 280 281 282 283 284 285 286 287 288 289 290 291 292 293 294 295 296 297 298 299 300 301 302 303 304 305 306 307 308 309 310 311 312 313 314 315 316 317 318 319 320 321 322 323 324 325 326 327 328 329 330 331 332 333 334 335 336 337 338 339 340 341 342 343 344 345 346 347 348 349 350 351 352 353 354 355 356 357 358 359 360 361 362 363 364 365 366 367 368 369 370 371 372 373 374 375 376 377 378 379 380 381 382 383 384 385 386 387 388 389 390 391 392 393 394 395 396 397 398 399 400 401 402 403 404 405 406 407 408 409 410 411 412 413 414 415 416 417 418 419 420 421 422 423 424 425 426 427 428 429 430 431 432 433 434 435 436 437 438 439 440 441 442 443 444 445 446 447 448 449 450 451 452 453 454 455 456 457 458 459 460 461 462 463 464 465 466 467 468 469 470 471 472 473 474 475 476 477 478 479 480 481 482 483 484 485 486 487 488 489 490 491 492 493 494 495 496 497 498 499 500 501 502 503 504 505 506 507 508 509 510 511 512 513 514 515 516 517 518 519 520 521 522 523 524 525 526 527 528 529 530 531 532 533 534 535 536 537 538 539 540 541 542 543 544 545 546 547 548 549 550 551 552 553 554 555 556 557 558 559 560 561 562 563 564 565 566 567 568 569 570 571 572 573 574 575 576 577 578 579 580 581 582 583 584 585 586 587 588 589 590 591 592 593 594 595 596 597 598 599 600 601 602 603 604 605 606 607 608 609 610 611 612 613 614 615 616 617 618 619 620 621 622 623 624 625 626 627 628 629 630 631 632 633 634 635 636 637 638 639 640 641 642 643 644 645 646 647 648 649 650 651 652 653 654 655 656 657 658 659 660 661 662 663 664 665 666 667 668 669 670 671 672 673 674 675 676 677 678 679 680 681 682 683 684 685 686 687 688 689 690 691 692 693 694 695 696 697 698 699 700 701 702 703 704 705 706 707 708 709 710 711 712 713 714 715 716 717 718 719 720 721 722 723 724 725 726 727 728 729 730 731 732 733 734 735 736 737 738 739 740 741 742 743 744 745 746 747 748 749 750 751 752 753 754 755 756 757 758 759 760 761 762 763 764 765 766 767 768 769 770 771 772 773 774 775 776 777 778 779 780 781 782 783 784 785 786 787 788 789 790 791 792 793 794 795 796 797 798 799 800 801 802 803 804 805 806 807 808 809 810 811 812 813 814 815 816 817 818 819 820 821 822 823 824 825 826 827 828 829 830 831 832 833 834 835 836 837 838 839 840 841 842 843 844 845 846 847 848 849 850 851 852 853 854 855 856 857 858 859 860 861 862 863 864 865 866 867 868 869 870 871 872 873 874 875 876 877 878 879 880 881 882 883 884 885 886 887 888 889 890 891 892 893 894 895 896 897 898 899 900 901 902 903 904 905 906 907 908 909 910 911 912 913 914 915 916 917 918 919 920 921 922 923 924 925 926 927 928 929 930 931 932 933 934 935 936 937 938 939
     int conj (void);
         ^
    _configtest.c:7:5: warning: conflicting types for built-in function ‘csqrt’ [enabled by default]
     int csqrt (void);
         ^
    _configtest.c:8:5: warning: conflicting types for built-in function ‘creal’ [enabled by default]
     int creal (void);
         ^
    _configtest.c:9:5: warning: conflicting types for built-in function ‘cproj’ [enabled by default]
     int cproj (void);
         ^
    _configtest.c:10:5: warning: conflicting types for built-in function ‘cpow’ [enabled by default]
     int cpow (void);
         ^
    _configtest.c:11:5: warning: conflicting types for built-in function ‘csinh’ [enabled by default]
     int csinh (void);
         ^
    _configtest.c:12:5: warning: conflicting types for built-in function ‘catan’ [enabled by default]
     int catan (void);
         ^
    _configtest.c:13:5: warning: conflicting types for built-in function ‘ctanh’ [enabled by default]
     int ctanh (void);
         ^
    _configtest.c:14:5: warning: conflicting types for built-in function ‘ccosh’ [enabled by default]
     int ccosh (void);
         ^
    _configtest.c:15:5: warning: conflicting types for built-in function ‘cimag’ [enabled by default]
     int cimag (void);
         ^
    _configtest.c:16:5: warning: conflicting types for built-in function ‘casin’ [enabled by default]
     int casin (void);
         ^
    _configtest.c:17:5: warning: conflicting types for built-in function ‘carg’ [enabled by default]
     int carg (void);
         ^
    _configtest.c:18:5: warning: conflicting types for built-in function ‘csin’ [enabled by default]
     int csin (void);
         ^
    _configtest.c:19:5: warning: conflicting types for built-in function ‘cexp’ [enabled by default]
     int cexp (void);
         ^
    _configtest.c:20:5: warning: conflicting types for built-in function ‘ccos’ [enabled by default]
     int ccos (void);
         ^
    _configtest.c:21:5: warning: conflicting types for built-in function ‘cacos’ [enabled by default]
     int cacos (void);
         ^
    _configtest.c:22:5: warning: conflicting types for built-in function ‘catanh’ [enabled by default]
     int catanh (void);
         ^
    gcc -pthread _configtest.o -lm -o _configtest
    success!
    removing: _configtest.c _configtest.o _configtest
    C compiler: gcc -pthread -fno-strict-aliasing -fmessage-length=0 -grecord-gcc-switches -O2 -Wall -D_FORTIFY_SOURCE=2 -fstack-protector -funwind-tables -fasynchronous-unwind-tables -g -DNDEBUG -fmessage-length=0 -grecord-gcc-switches -O2 -Wall -D_FORTIFY_SOURCE=2 -fstack-protector -funwind-tables -fasynchronous-unwind-tables -g -DOPENSSL_LOAD_CONF -fPIC
    
    compile options: '-Inumpy/core/src/private -Inumpy/core/src -Inumpy/core -Inumpy/core/src/npymath -Inumpy/core/src/multiarray -Inumpy/core/src/umath -Inumpy/core/src/npysort -I/usr/include/python2.7 -c'
    gcc: _configtest.c
    _configtest.c:1:5: warning: conflicting types for built-in function ‘ctanhf’ [enabled by default]
     int ctanhf (void);
         ^
    _configtest.c:2:5: warning: conflicting types for built-in function ‘csinhf’ [enabled by default]
     int csinhf (void);
         ^
    _configtest.c:3:5: warning: conflicting types for built-in function ‘cprojf’ [enabled by default]
     int cprojf (void);
         ^
    _configtest.c:4:5: warning: conflicting types for built-in function ‘cacoshf’ [enabled by default]
     int cacoshf (void);
         ^
    _configtest.c:5:5: warning: conflicting types for built-in function ‘cacosf’ [enabled by default]
     int cacosf (void);
         ^
    _configtest.c:6:5: warning: conflicting types for built-in function ‘cargf’ [enabled by default]
     int cargf (void);
         ^
    _configtest.c:7:5: warning: conflicting types for built-in function ‘cpowf’ [enabled by default]
     int cpowf (void);
         ^
    _configtest.c:8:5: warning: conflicting types for built-in function ‘csinf’ [enabled by default]
     int csinf (void);
         ^
    _configtest.c:9:5: warning: conflicting types for built-in function ‘clogf’ [enabled by default]
     int clogf (void);
         ^
    _configtest.c:10:5: warning: conflicting types for built-in function ‘ccoshf’ [enabled by default]
     int ccoshf (void);
         ^
    _configtest.c:11:5: warning: conflicting types for built-in function ‘conjf’ [enabled by default]
     int conjf (void);
         ^
    _configtest.c:12:5: warning: conflicting types for built-in function ‘casinhf’ [enabled by default]
     int casinhf (void);
         ^
    _configtest.c:13:5: warning: conflicting types for built-in function ‘ccosf’ [enabled by default]
     int ccosf (void);
         ^
    _configtest.c:14:5: warning: conflicting types for built-in function ‘ctanf’ [enabled by default]
     int ctanf (void);
         ^
    _configtest.c:15:5: warning: conflicting types for built-in function ‘cexpf’ [enabled by default]
     int cexpf (void);
         ^
    _configtest.c:16:5: warning: conflicting types for built-in function ‘cimagf’ [enabled by default]
     int cimagf (void);
         ^
    _configtest.c:17:5: warning: conflicting types for built-in function ‘catanhf’ [enabled by default]
     int catanhf (void);
         ^
    _configtest.c:18:5: warning: conflicting types for built-in function ‘casinf’ [enabled by default]
     int casinf (void);
         ^
    _configtest.c:19:5: warning: conflicting types for built-in function ‘catanf’ [enabled by default]
     int catanf (void);
         ^
    _configtest.c:20:5: warning: conflicting types for built-in function ‘csqrtf’ [enabled by default]
     int csqrtf (void);
         ^
    _configtest.c:21:5: warning: conflicting types for built-in function ‘crealf’ [enabled by default]
     int crealf (void);
         ^
    _configtest.c:22:5: warning: conflicting types for built-in function ‘cabsf’ [enabled by default]
     int cabsf (void);
         ^
    gcc -pthread _configtest.o -lm -o _configtest
    success!
    removing: _configtest.c _configtest.o _configtest
    C compiler: gcc -pthread -fno-strict-aliasing -fmessage-length=0 -grecord-gcc-switches -O2 -Wall -D_FORTIFY_SOURCE=2 -fstack-protector -funwind-tables -fasynchronous-unwind-tables -g -DNDEBUG -fmessage-length=0 -grecord-gcc-switches -O2 -Wall -D_FORTIFY_SOURCE=2 -fstack-protector -funwind-tables -fasynchronous-unwind-tables -g -DOPENSSL_LOAD_CONF -fPIC
    
    compile options: '-Inumpy/core/src/private -Inumpy/core/src -Inumpy/core -Inumpy/core/src/npymath -Inumpy/core/src/multiarray -Inumpy/core/src/umath -Inumpy/core/src/npysort -I/usr/include/python2.7 -c'
    gcc: _configtest.c
    _configtest.c:1:5: warning: conflicting types for built-in function ‘csinhl’ [enabled by default]
     int csinhl (void);
         ^
    _configtest.c:2:5: warning: conflicting types for built-in function ‘ctanhl’ [enabled by default]
     int ctanhl (void);
         ^
    _configtest.c:3:5: warning: conflicting types for built-in function ‘cacosl’ [enabled by default]
     int cacosl (void);
         ^
    _configtest.c:4:5: warning: conflicting types for built-in function ‘cacoshl’ [enabled by default]
     int cacoshl (void);
         ^
    _configtest.c:5:5: warning: conflicting types for built-in function ‘cprojl’ [enabled by default]
     int cprojl (void);
         ^
    _configtest.c:6:5: warning: conflicting types for built-in function ‘cargl’ [enabled by default]
     int cargl (void);
         ^
    _configtest.c:7:5: warning: conflicting types for built-in function ‘ccoshl’ [enabled by default]
     int ccoshl (void);
         ^
    _configtest.c:8:5: warning: conflicting types for built-in function ‘conjl’ [enabled by default]
     int conjl (void);
         ^
    _configtest.c:9:5: warning: conflicting types for built-in function ‘csinl’ [enabled by default]
     int csinl (void);
         ^
    _configtest.c:10:5: warning: conflicting types for built-in function ‘clogl’ [enabled by default]
     int clogl (void);
         ^
    _configtest.c:11:5: warning: conflicting types for built-in function ‘cexpl’ [enabled by default]
     int cexpl (void);
         ^
    _configtest.c:12:5: warning: conflicting types for built-in function ‘ccosl’ [enabled by default]
     int ccosl (void);
         ^
    _configtest.c:13:5: warning: conflicting types for built-in function ‘ctanl’ [enabled by default]
     int ctanl (void);
         ^
    _configtest.c:14:5: warning: conflicting types for built-in function ‘cpowl’ [enabled by default]
     int cpowl (void);
         ^
    _configtest.c:15:5: warning: conflicting types for built-in function ‘casinhl’ [enabled by default]
     int casinhl (void);
         ^
    _configtest.c:16:5: warning: conflicting types for built-in function ‘csqrtl’ [enabled by default]
     int csqrtl (void);
         ^
    _configtest.c:17:5: warning: conflicting types for built-in function ‘casinl’ [enabled by default]
     int casinl (void);
         ^
    _configtest.c:18:5: warning: conflicting types for built-in function ‘catanl’ [enabled by default]
     int catanl (void);
         ^
    _configtest.c:19:5: warning: conflicting types for built-in function ‘catanhl’ [enabled by default]
     int catanhl (void);
         ^
    _configtest.c:20:5: warning: conflicting types for built-in function ‘creall’ [enabled by default]
     int creall (void);
         ^
    _configtest.c:21:5: warning: conflicting types for built-in function ‘cabsl’ [enabled by default]
     int cabsl (void);
         ^
    _configtest.c:22:5: warning: conflicting types for built-in function ‘cimagl’ [enabled by default]
     int cimagl (void);
         ^
    gcc -pthread _configtest.o -lm -o _configtest
    success!
    removing: _configtest.c _configtest.o _configtest
    C compiler: gcc -pthread -fno-strict-aliasing -fmessage-length=0 -grecord-gcc-switches -O2 -Wall -D_FORTIFY_SOURCE=2 -fstack-protector -funwind-tables -fasynchronous-unwind-tables -g -DNDEBUG -fmessage-length=0 -grecord-gcc-switches -O2 -Wall -D_FORTIFY_SOURCE=2 -fstack-protector -funwind-tables -fasynchronous-unwind-tables -g -DOPENSSL_LOAD_CONF -fPIC
    
    compile options: '-Inumpy/core/src/private -Inumpy/core/src -Inumpy/core -Inumpy/core/src/npymath -Inumpy/core/src/multiarray -Inumpy/core/src/umath -Inumpy/core/src/npysort -I/usr/include/python2.7 -c'
    gcc: _configtest.c
    _configtest.c:2:41: error: expected ‘;’, ‘,’ or ‘)’ before ‘a’
     static int static_func (char * restrict a)
                                             ^
    _configtest.c:2:41: error: expected ‘;’, ‘,’ or ‘)’ before ‘a’
     static int static_func (char * restrict a)
                                             ^
    failure.
    removing: _configtest.c _configtest.o
    C compiler: gcc -pthread -fno-strict-aliasing -fmessage-length=0 -grecord-gcc-switches -O2 -Wall -D_FORTIFY_SOURCE=2 -fstack-protector -funwind-tables -fasynchronous-unwind-tables -g -DNDEBUG -fmessage-length=0 -grecord-gcc-switches -O2 -Wall -D_FORTIFY_SOURCE=2 -fstack-protector -funwind-tables -fasynchronous-unwind-tables -g -DOPENSSL_LOAD_CONF -fPIC
    
    compile options: '-Inumpy/core/src/private -Inumpy/core/src -Inumpy/core -Inumpy/core/src/npymath -Inumpy/core/src/multiarray -Inumpy/core/src/umath -Inumpy/core/src/npysort -I/usr/include/python2.7 -c'
    gcc: _configtest.c
    _configtest.c:2:12: warning: ‘static_func’ defined but not used [-Wunused-function]
     static int static_func (char * __restrict__ a)
                ^
    success!
    removing: _configtest.c _configtest.o
    C compiler: gcc -pthread -fno-strict-aliasing -fmessage-length=0 -grecord-gcc-switches -O2 -Wall -D_FORTIFY_SOURCE=2 -fstack-protector -funwind-tables -fasynchronous-unwind-tables -g -DNDEBUG -fmessage-length=0 -grecord-gcc-switches -O2 -Wall -D_FORTIFY_SOURCE=2 -fstack-protector -funwind-tables -fasynchronous-unwind-tables -g -DOPENSSL_LOAD_CONF -fPIC
    
    compile options: '-Inumpy/core/src/private -Inumpy/core/src -Inumpy/core -Inumpy/core/src/npymath -Inumpy/core/src/multiarray -Inumpy/core/src/umath -Inumpy/core/src/npysort -I/usr/include/python2.7 -c'
    gcc: _configtest.c
    success!
    removing: _configtest.c _configtest.o
    C compiler: gcc -pthread -fno-strict-aliasing -fmessage-length=0 -grecord-gcc-switches -O2 -Wall -D_FORTIFY_SOURCE=2 -fstack-protector -funwind-tables -fasynchronous-unwind-tables -g -DNDEBUG -fmessage-length=0 -grecord-gcc-switches -O2 -Wall -D_FORTIFY_SOURCE=2 -fstack-protector -funwind-tables -fasynchronous-unwind-tables -g -DOPENSSL_LOAD_CONF -fPIC
    
    compile options: '-Inumpy/core/src/private -Inumpy/core/src -Inumpy/core -Inumpy/core/src/npymath -Inumpy/core/src/multiarray -Inumpy/core/src/umath -Inumpy/core/src/npysort -I/usr/include/python2.7 -c'
    gcc: _configtest.c
    success!
    removing: _configtest.c _configtest.o
    C compiler: gcc -pthread -fno-strict-aliasing -fmessage-length=0 -grecord-gcc-switches -O2 -Wall -D_FORTIFY_SOURCE=2 -fstack-protector -funwind-tables -fasynchronous-unwind-tables -g -DNDEBUG -fmessage-length=0 -grecord-gcc-switches -O2 -Wall -D_FORTIFY_SOURCE=2 -fstack-protector -funwind-tables -fasynchronous-unwind-tables -g -DOPENSSL_LOAD_CONF -fPIC
    
    compile options: '-Inumpy/core/src/private -Inumpy/core/src -Inumpy/core -Inumpy/core/src/npymath -Inumpy/core/src/multiarray -Inumpy/core/src/umath -Inumpy/core/src/npysort -I/usr/include/python2.7 -c'
    gcc: _configtest.c
    removing: _configtest.c _configtest.o
    File: build/src.linux-x86_64-2.7/numpy/core/include/numpy/config.h
    #define HAVE_ENDIAN_H 1
    #define SIZEOF_PY_INTPTR_T 8
    #define SIZEOF_OFF_T 8
    #define SIZEOF_PY_LONG_LONG 8
    #define MATHLIB m
    #define HAVE_SIN 1
    #define HAVE_COS 1
    #define HAVE_TAN 1
    #define HAVE_SINH 1
    #define HAVE_COSH 1
    #define HAVE_TANH 1
    #define HAVE_FABS 1
    #define HAVE_FLOOR 1
    #define HAVE_CEIL 1
    #define HAVE_SQRT 1
    #define HAVE_LOG10 1
    #define HAVE_LOG 1
    #define HAVE_EXP 1
    #define HAVE_ASIN 1
    #define HAVE_ACOS 1
    #define HAVE_ATAN 1
    #define HAVE_FMOD 1
    #define HAVE_MODF 1
    #define HAVE_FREXP 1
    #define HAVE_LDEXP 1
    #define HAVE_RINT 1
    #define HAVE_TRUNC 1
    #define HAVE_EXP2 1
    #define HAVE_LOG2 1
    #define HAVE_ATAN2 1
    #define HAVE_POW 1
    #define HAVE_NEXTAFTER 1
    #define HAVE_STRTOLL 1
    #define HAVE_STRTOULL 1
    #define HAVE_CBRT 1
    #define HAVE_STRTOLD_L 1
    #define HAVE_FALLOCATE 1
    #define HAVE_XMMINTRIN_H 1
    #define HAVE_EMMINTRIN_H 1
    #define HAVE_FEATURES_H 1
    #define HAVE___BUILTIN_ISNAN 1
    #define HAVE___BUILTIN_ISINF 1
    #define HAVE___BUILTIN_ISFINITE 1
    #define HAVE___BUILTIN_BSWAP32 1
    #define HAVE___BUILTIN_BSWAP64 1
    #define HAVE___BUILTIN_EXPECT 1
    #define HAVE__MM_LOAD_PS 1
    #define HAVE__MM_PREFETCH 1
    #define HAVE__MM_LOAD_PD 1
    #define HAVE___BUILTIN_PREFETCH 1
    #define HAVE_ATTRIBUTE_OPTIMIZE_UNROLL_LOOPS 1
    #define HAVE_ATTRIBUTE_OPTIMIZE_OPT_3 1
    #define HAVE_ATTRIBUTE_NONNULL 1
    #define HAVE___THREAD 1
    #define HAVE_SINF 1
    #define HAVE_COSF 1
    #define HAVE_TANF 1
    #define HAVE_SINHF 1
    #define HAVE_COSHF 1
    #define HAVE_TANHF 1
    #define HAVE_FABSF 1
    #define HAVE_FLOORF 1
    #define HAVE_CEILF 1
    #define HAVE_RINTF 1
    #define HAVE_TRUNCF 1
    #define HAVE_SQRTF 1
    #define HAVE_LOG10F 1
    #define HAVE_LOGF 1
    #define HAVE_LOG1PF 1
    #define HAVE_EXPF 1
    #define HAVE_EXPM1F 1
    #define HAVE_ASINF 1
    #define HAVE_ACOSF 1
    #define HAVE_ATANF 1
    #define HAVE_ASINHF 1
    #define HAVE_ACOSHF 1
    #define HAVE_ATANHF 1
    #define HAVE_HYPOTF 1
    #define HAVE_ATAN2F 1
    #define HAVE_POWF 1
    #define HAVE_FMODF 1
    #define HAVE_MODFF 1
    #define HAVE_FREXPF 1
    #define HAVE_LDEXPF 1
    #define HAVE_EXP2F 1
    #define HAVE_LOG2F 1
    #define HAVE_COPYSIGNF 1
    #define HAVE_NEXTAFTERF 1
    #define HAVE_CBRTF 1
    #define HAVE_SINL 1
    #define HAVE_COSL 1
    #define HAVE_TANL 1
    #define HAVE_SINHL 1
    #define HAVE_COSHL 1
    #define HAVE_TANHL 1
    #define HAVE_FABSL 1
    #define HAVE_FLOORL 1
    #define HAVE_CEILL 1
    #define HAVE_RINTL 1
    #define HAVE_TRUNCL 1
    #define HAVE_SQRTL 1
    #define HAVE_LOG10L 1
    #define HAVE_LOGL 1
    #define HAVE_LOG1PL 1
    #define HAVE_EXPL 1
    #define HAVE_EXPM1L 1
    #define HAVE_ASINL 1
    #define HAVE_ACOSL 1
    #define HAVE_ATANL 1
    #define HAVE_ASINHL 1
    #define HAVE_ACOSHL 1
    #define HAVE_ATANHL 1
    #define HAVE_HYPOTL 1
    #define HAVE_ATAN2L 1
    #define HAVE_POWL 1
    #define HAVE_FMODL 1
    #define HAVE_MODFL 1
    #define HAVE_FREXPL 1
    #define HAVE_LDEXPL 1
    #define HAVE_EXP2L 1
    #define HAVE_LOG2L 1
    #define HAVE_COPYSIGNL 1
    #define HAVE_NEXTAFTERL 1
    #define HAVE_CBRTL 1
    #define HAVE_DECL_SIGNBIT
    #define HAVE_COMPLEX_H 1
    #define HAVE_CABS 1
    #define HAVE_CACOS 1
    #define HAVE_CACOSH 1
    #define HAVE_CARG 1
    #define HAVE_CASIN 1
    #define HAVE_CASINH 1
    #define HAVE_CATAN 1
    #define HAVE_CATANH 1
    #define HAVE_CCOS 1
    #define HAVE_CCOSH 1
    #define HAVE_CEXP 1
    #define HAVE_CIMAG 1
    #define HAVE_CLOG 1
    #define HAVE_CONJ 1
    #define HAVE_CPOW 1
    #define HAVE_CPROJ 1
    #define HAVE_CREAL 1
    #define HAVE_CSIN 1
    #define HAVE_CSINH 1
    #define HAVE_CSQRT 1
    #define HAVE_CTAN 1
    #define HAVE_CTANH 1
    #define HAVE_CABSF 1
    #define HAVE_CACOSF 1
    #define HAVE_CACOSHF 1
    #define HAVE_CARGF 1
    #define HAVE_CASINF 1
    #define HAVE_CASINHF 1
    #define HAVE_CATANF 1
    #define HAVE_CATANHF 1
    #define HAVE_CCOSF 1
    #define HAVE_CCOSHF 1
    #define HAVE_CEXPF 1
    #define HAVE_CIMAGF 1
    #define HAVE_CLOGF 1
    #define HAVE_CONJF 1
    #define HAVE_CPOWF 1
    #define HAVE_CPROJF 1
    #define HAVE_CREALF 1
    #define HAVE_CSINF 1
    #define HAVE_CSINHF 1
    #define HAVE_CSQRTF 1
    #define HAVE_CTANF 1
    #define HAVE_CTANHF 1
    #define HAVE_CABSL 1
    #define HAVE_CACOSL 1
    #define HAVE_CACOSHL 1
    #define HAVE_CARGL 1
    #define HAVE_CASINL 1
    #define HAVE_CASINHL 1
    #define HAVE_CATANL 1
    #define HAVE_CATANHL 1
    #define HAVE_CCOSL 1
    #define HAVE_CCOSHL 1
    #define HAVE_CEXPL 1
    #define HAVE_CIMAGL 1
    #define HAVE_CLOGL 1
    #define HAVE_CONJL 1
    #define HAVE_CPOWL 1
    #define HAVE_CPROJL 1
    #define HAVE_CREALL 1
    #define HAVE_CSINL 1
    #define HAVE_CSINHL 1
    #define HAVE_CSQRTL 1
    #define HAVE_CTANL 1
    #define HAVE_CTANHL 1
    #define NPY_RESTRICT __restrict__
    #define HAVE_LDOUBLE_INTEL_EXTENDED_16_BYTES_LE 1
    #ifndef __cplusplus
    /* #undef inline */
    #endif
    
    #ifndef _NPY_NPY_CONFIG_H_
    #error config.h should never be included directly, include npy_config.h instead
    #endif
    
    EOF
      adding 'build/src.linux-x86_64-2.7/numpy/core/include/numpy/config.h' to sources.
    Generating build/src.linux-x86_64-2.7/numpy/core/include/numpy/_numpyconfig.h
    C compiler: gcc -pthread -fno-strict-aliasing -fmessage-length=0 -grecord-gcc-switches -O2 -Wall -D_FORTIFY_SOURCE=2 -fstack-protector -funwind-tables -fasynchronous-unwind-tables -g -DNDEBUG -fmessage-length=0 -grecord-gcc-switches -O2 -Wall -D_FORTIFY_SOURCE=2 -fstack-protector -funwind-tables -fasynchronous-unwind-tables -g -DOPENSSL_LOAD_CONF -fPIC
    
    compile options: '-Inumpy/core/src/private -Inumpy/core/src -Inumpy/core -Inumpy/core/src/npymath -Inumpy/core/src/multiarray -Inumpy/core/src/umath -Inumpy/core/src/npysort -I/usr/include/python2.7 -c'
    gcc: _configtest.c
    _configtest.c:1:5: warning: conflicting types for built-in function ‘exp’ [enabled by default]
     int exp (void);
         ^
    gcc -pthread _configtest.o -o _configtest
    _configtest.o: In function `main':
    /home/ivan/test/build/numpy/_configtest.c:6: undefined reference to `exp'
    collect2: error: ld returned 1 exit status
    _configtest.o: In function `main':
    /home/ivan/test/build/numpy/_configtest.c:6: undefined reference to `exp'
    collect2: error: ld returned 1 exit status
    failure.
    removing: _configtest.c _configtest.o
    C compiler: gcc -pthread -fno-strict-aliasing -fmessage-length=0 -grecord-gcc-switches -O2 -Wall -D_FORTIFY_SOURCE=2 -fstack-protector -funwind-tables -fasynchronous-unwind-tables -g -DNDEBUG -fmessage-length=0 -grecord-gcc-switches -O2 -Wall -D_FORTIFY_SOURCE=2 -fstack-protector -funwind-tables -fasynchronous-unwind-tables -g -DOPENSSL_LOAD_CONF -fPIC
    
    compile options: '-Inumpy/core/src/private -Inumpy/core/src -Inumpy/core -Inumpy/core/src/npymath -Inumpy/core/src/multiarray -Inumpy/core/src/umath -Inumpy/core/src/npysort -I/usr/include/python2.7 -c'
    gcc: _configtest.c
    _configtest.c:1:5: warning: conflicting types for built-in function ‘exp’ [enabled by default]
     int exp (void);
         ^
    gcc -pthread _configtest.o -lm -o _configtest
    success!
    removing: _configtest.c _configtest.o _configtest
    C compiler: gcc -pthread -fno-strict-aliasing -fmessage-length=0 -grecord-gcc-switches -O2 -Wall -D_FORTIFY_SOURCE=2 -fstack-protector -funwind-tables -fasynchronous-unwind-tables -g -DNDEBUG -fmessage-length=0 -grecord-gcc-switches -O2 -Wall -D_FORTIFY_SOURCE=2 -fstack-protector -funwind-tables -fasynchronous-unwind-tables -g -DOPENSSL_LOAD_CONF -fPIC
    
    compile options: '-Inumpy/core/src/private -Inumpy/core/src -Inumpy/core -Inumpy/core/src/npymath -Inumpy/core/src/multiarray -Inumpy/core/src/umath -Inumpy/core/src/npysort -I/usr/include/python2.7 -c'
    gcc: _configtest.c
    success!
    removing: _configtest.c _configtest.o
    C compiler: gcc -pthread -fno-strict-aliasing -fmessage-length=0 -grecord-gcc-switches -O2 -Wall -D_FORTIFY_SOURCE=2 -fstack-protector -funwind-tables -fasynchronous-unwind-tables -g -DNDEBUG -fmessage-length=0 -grecord-gcc-switches -O2 -Wall -D_FORTIFY_SOURCE=2 -fstack-protector -funwind-tables -fasynchronous-unwind-tables -g -DOPENSSL_LOAD_CONF -fPIC
    
    compile options: '-Inumpy/core/src/private -Inumpy/core/src -Inumpy/core -Inumpy/core/src/npymath -Inumpy/core/src/multiarray -Inumpy/core/src/umath -Inumpy/core/src/npysort -I/usr/include/python2.7 -c'
    gcc: _configtest.c
    success!
    removing: _configtest.c _configtest.o
    File: build/src.linux-x86_64-2.7/numpy/core/include/numpy/_numpyconfig.h
    #define NPY_HAVE_ENDIAN_H 1
    #define NPY_SIZEOF_SHORT SIZEOF_SHORT
    #define NPY_SIZEOF_INT SIZEOF_INT
    #define NPY_SIZEOF_LONG SIZEOF_LONG
    #define NPY_SIZEOF_FLOAT 4
    #define NPY_SIZEOF_COMPLEX_FLOAT 8
    #define NPY_SIZEOF_DOUBLE 8
    #define NPY_SIZEOF_COMPLEX_DOUBLE 16
    #define NPY_SIZEOF_LONGDOUBLE 16
    #define NPY_SIZEOF_COMPLEX_LONGDOUBLE 32
    #define NPY_SIZEOF_PY_INTPTR_T 8
    #define NPY_SIZEOF_OFF_T 8
    #define NPY_SIZEOF_PY_LONG_LONG 8
    #define NPY_SIZEOF_LONGLONG 8
    #define NPY_NO_SMP 0
    #define NPY_HAVE_DECL_ISNAN
    #define NPY_HAVE_DECL_ISINF
    #define NPY_HAVE_DECL_ISFINITE
    #define NPY_HAVE_DECL_SIGNBIT
    #define NPY_USE_C99_COMPLEX 1
    #define NPY_HAVE_COMPLEX_DOUBLE 1
    #define NPY_HAVE_COMPLEX_FLOAT 1
    #define NPY_HAVE_COMPLEX_LONG_DOUBLE 1
    #define NPY_USE_C99_FORMATS 1
    #define NPY_VISIBILITY_HIDDEN __attribute__((visibility("hidden")))
    #define NPY_ABI_VERSION 0x01000009
    #define NPY_API_VERSION 0x0000000A
    
    #ifndef __STDC_FORMAT_MACROS
    #define __STDC_FORMAT_MACROS 1
    #endif
    
    EOF
      adding 'build/src.linux-x86_64-2.7/numpy/core/include/numpy/_numpyconfig.h' to sources.
    executing numpy/core/code_generators/generate_numpy_api.py
      adding 'build/src.linux-x86_64-2.7/numpy/core/include/numpy/__multiarray_api.h' to sources.
    numpy.core - nothing done with h_files = ['build/src.linux-x86_64-2.7/numpy/core/include/numpy/config.h', 'build/src.linux-x86_64-2.7/numpy/core/include/numpy/_numpyconfig.h', 'build/src.linux-x86_64-2.7/numpy/core/include/numpy/__multiarray_api.h']
    building extension "numpy.core.multiarray" sources
      adding 'build/src.linux-x86_64-2.7/numpy/core/include/numpy/config.h' to sources.
      adding 'build/src.linux-x86_64-2.7/numpy/core/include/numpy/_numpyconfig.h' to sources.
    executing numpy/core/code_generators/generate_numpy_api.py
      adding 'build/src.linux-x86_64-2.7/numpy/core/include/numpy/__multiarray_api.h' to sources.
    conv_template:> build/src.linux-x86_64-2.7/numpy/core/src/multiarray/arraytypes.c
    conv_template:> build/src.linux-x86_64-2.7/numpy/core/src/multiarray/einsum.c
    conv_template:> build/src.linux-x86_64-2.7/numpy/core/src/multiarray/lowlevel_strided_loops.c
    conv_template:> build/src.linux-x86_64-2.7/numpy/core/src/multiarray/nditer_templ.c
    conv_template:> build/src.linux-x86_64-2.7/numpy/core/src/multiarray/scalartypes.c
    conv_template:> build/src.linux-x86_64-2.7/numpy/core/src/private/templ_common.h
      adding 'build/src.linux-x86_64-2.7/numpy/core/src/private' to include_dirs.
    numpy.core - nothing done with h_files = ['build/src.linux-x86_64-2.7/numpy/core/src/private/templ_common.h', 'build/src.linux-x86_64-2.7/numpy/core/include/numpy/config.h', 'build/src.linux-x86_64-2.7/numpy/core/include/numpy/_numpyconfig.h', 'build/src.linux-x86_64-2.7/numpy/core/include/numpy/__multiarray_api.h']
    building extension "numpy.core.umath" sources
      adding 'build/src.linux-x86_64-2.7/numpy/core/include/numpy/config.h' to sources.
      adding 'build/src.linux-x86_64-2.7/numpy/core/include/numpy/_numpyconfig.h' to sources.
    executing numpy/core/code_generators/generate_ufunc_api.py
      adding 'build/src.linux-x86_64-2.7/numpy/core/include/numpy/__ufunc_api.h' to sources.
    conv_template:> build/src.linux-x86_64-2.7/numpy/core/src/umath/funcs.inc
      adding 'build/src.linux-x86_64-2.7/numpy/core/src/umath' to include_dirs.
    conv_template:> build/src.linux-x86_64-2.7/numpy/core/src/umath/simd.inc
    conv_template:> build/src.linux-x86_64-2.7/numpy/core/src/umath/loops.h
    conv_template:> build/src.linux-x86_64-2.7/numpy/core/src/umath/loops.c
    conv_template:> build/src.linux-x86_64-2.7/numpy/core/src/umath/scalarmath.c
    numpy.core - nothing done with h_files = ['build/src.linux-x86_64-2.7/numpy/core/src/umath/funcs.inc', 'build/src.linux-x86_64-2.7/numpy/core/src/umath/simd.inc', 'build/src.linux-x86_64-2.7/numpy/core/src/umath/loops.h', 'build/src.linux-x86_64-2.7/numpy/core/include/numpy/config.h', 'build/src.linux-x86_64-2.7/numpy/core/include/numpy/_numpyconfig.h', 'build/src.linux-x86_64-2.7/numpy/core/include/numpy/__ufunc_api.h']
    building extension "numpy.core.umath_tests" sources
    conv_template:> build/src.linux-x86_64-2.7/numpy/core/src/umath/umath_tests.c
    building extension "numpy.core.test_rational" sources
    conv_template:> build/src.linux-x86_64-2.7/numpy/core/src/umath/test_rational.c
    building extension "numpy.core.struct_ufunc_test" sources
    conv_template:> build/src.linux-x86_64-2.7/numpy/core/src/umath/struct_ufunc_test.c
    building extension "numpy.core.multiarray_tests" sources
    conv_template:> build/src.linux-x86_64-2.7/numpy/core/src/multiarray/multiarray_tests.c
    building extension "numpy.core.operand_flag_tests" sources
    conv_template:> build/src.linux-x86_64-2.7/numpy/core/src/umath/operand_flag_tests.c
    building extension "numpy.fft.fftpack_lite" sources
    building extension "numpy.linalg.lapack_lite" sources
      adding 'numpy/linalg/lapack_lite/python_xerbla.c' to sources.
    building extension "numpy.linalg._umath_linalg" sources
      adding 'numpy/linalg/lapack_lite/python_xerbla.c' to sources.
    conv_template:> build/src.linux-x86_64-2.7/numpy/linalg/umath_linalg.c
    building extension "numpy.random.mtrand" sources
    building data_files sources
    build_src: building npy-pkg config files
    customize UnixCCompiler
    customize UnixCCompiler using build_clib
    building 'npymath' library
    compiling C sources
    C compiler: gcc -pthread -fno-strict-aliasing -fmessage-length=0 -grecord-gcc-switches -O2 -Wall -D_FORTIFY_SOURCE=2 -fstack-protector -funwind-tables -fasynchronous-unwind-tables -g -DNDEBUG -fmessage-length=0 -grecord-gcc-switches -O2 -Wall -D_FORTIFY_SOURCE=2 -fstack-protector -funwind-tables -fasynchronous-unwind-tables -g -DOPENSSL_LOAD_CONF -fPIC
    
    compile options: '-Inumpy/core/include -Ibuild/src.linux-x86_64-2.7/numpy/core/include/numpy -Inumpy/core/src/private -Inumpy/core/src -Inumpy/core -Inumpy/core/src/npymath -Inumpy/core/src/multiarray -Inumpy/core/src/umath -Inumpy/core/src/npysort -I/usr/include/python2.7 -Ibuild/src.linux-x86_64-2.7/numpy/core/src/private -Ibuild/src.linux-x86_64-2.7/numpy/core/src/private -Ibuild/src.linux-x86_64-2.7/numpy/core/src/private -c'
    gcc: numpy/core/src/npymath/halffloat.c
    gcc: build/src.linux-x86_64-2.7/numpy/core/src/npymath/ieee754.c
    gcc: build/src.linux-x86_64-2.7/numpy/core/src/npymath/npy_math.c
    gcc: build/src.linux-x86_64-2.7/numpy/core/src/npymath/npy_math_complex.c
    ar: adding 4 object files to build/temp.linux-x86_64-2.7/libnpymath.a
    building 'npysort' library
    compiling C sources
    C compiler: gcc -pthread -fno-strict-aliasing -fmessage-length=0 -grecord-gcc-switches -O2 -Wall -D_FORTIFY_SOURCE=2 -fstack-protector -funwind-tables -fasynchronous-unwind-tables -g -DNDEBUG -fmessage-length=0 -grecord-gcc-switches -O2 -Wall -D_FORTIFY_SOURCE=2 -fstack-protector -funwind-tables -fasynchronous-unwind-tables -g -DOPENSSL_LOAD_CONF -fPIC
    
    compile options: '-Ibuild/src.linux-x86_64-2.7/numpy/core/src/private -Inumpy/core/include -Ibuild/src.linux-x86_64-2.7/numpy/core/include/numpy -Inumpy/core/src/private -Inumpy/core/src -Inumpy/core -Inumpy/core/src/npymath -Inumpy/core/src/multiarray -Inumpy/core/src/umath -Inumpy/core/src/npysort -I/usr/include/python2.7 -Ibuild/src.linux-x86_64-2.7/numpy/core/src/private -Ibuild/src.linux-x86_64-2.7/numpy/core/src/private -Ibuild/src.linux-x86_64-2.7/numpy/core/src/private -c'
    gcc: build/src.linux-x86_64-2.7/numpy/core/src/npysort/selection.c
    gcc: build/src.linux-x86_64-2.7/numpy/core/src/npysort/quicksort.c
    gcc: build/src.linux-x86_64-2.7/numpy/core/src/npysort/mergesort.c
    gcc: build/src.linux-x86_64-2.7/numpy/core/src/npysort/binsearch.c
    gcc: build/src.linux-x86_64-2.7/numpy/core/src/npysort/heapsort.c
    ar: adding 5 object files to build/temp.linux-x86_64-2.7/libnpysort.a
    customize UnixCCompiler
    customize UnixCCompiler using build_ext
    customize Gnu95FCompiler
    customize Gnu95FCompiler
    customize Gnu95FCompiler using build_ext
    building 'numpy.core._dummy' extension
    compiling C sources
    C compiler: gcc -pthread -fno-strict-aliasing -fmessage-length=0 -grecord-gcc-switches -O2 -Wall -D_FORTIFY_SOURCE=2 -fstack-protector -funwind-tables -fasynchronous-unwind-tables -g -DNDEBUG -fmessage-length=0 -grecord-gcc-switches -O2 -Wall -D_FORTIFY_SOURCE=2 -fstack-protector -funwind-tables -fasynchronous-unwind-tables -g -DOPENSSL_LOAD_CONF -fPIC
    
    compile options: '-DHAVE_NPY_CONFIG_H=1 -D_FILE_OFFSET_BITS=64 -D_LARGEFILE_SOURCE=1 -D_LARGEFILE64_SOURCE=1 -Inumpy/core/include -Ibuild/src.linux-x86_64-2.7/numpy/core/include/numpy -Inumpy/core/src/private -Inumpy/core/src -Inumpy/core -Inumpy/core/src/npymath -Inumpy/core/src/multiarray -Inumpy/core/src/umath -Inumpy/core/src/npysort -I/usr/include/python2.7 -Ibuild/src.linux-x86_64-2.7/numpy/core/src/private -Ibuild/src.linux-x86_64-2.7/numpy/core/src/private -Ibuild/src.linux-x86_64-2.7/numpy/core/src/private -c'
    gcc: numpy/core/src/dummymodule.c
    gcc -pthread -shared build/temp.linux-x86_64-2.7/numpy/core/src/dummymodule.o -L/usr/lib64 -Lbuild/temp.linux-x86_64-2.7 -lm -lpython2.7 -o build/lib.linux-x86_64-2.7/numpy/core/_dummy.so
    building 'numpy.core.multiarray' extension
    compiling C sources
    C compiler: gcc -pthread -fno-strict-aliasing -fmessage-length=0 -grecord-gcc-switches -O2 -Wall -D_FORTIFY_SOURCE=2 -fstack-protector -funwind-tables -fasynchronous-unwind-tables -g -DNDEBUG -fmessage-length=0 -grecord-gcc-switches -O2 -Wall -D_FORTIFY_SOURCE=2 -fstack-protector -funwind-tables -fasynchronous-unwind-tables -g -DOPENSSL_LOAD_CONF -fPIC
    
    compile options: '-DHAVE_NPY_CONFIG_H=1 -D_FILE_OFFSET_BITS=64 -D_LARGEFILE_SOURCE=1 -D_LARGEFILE64_SOURCE=1 -Ibuild/src.linux-x86_64-2.7/numpy/core/src/private -Inumpy/core/include -Ibuild/src.linux-x86_64-2.7/numpy/core/include/numpy -Inumpy/core/src/private -Inumpy/core/src -Inumpy/core -Inumpy/core/src/npymath -Inumpy/core/src/multiarray -Inumpy/core/src/umath -Inumpy/core/src/npysort -I/usr/include/python2.7 -Ibuild/src.linux-x86_64-2.7/numpy/core/src/private -Ibuild/src.linux-x86_64-2.7/numpy/core/src/private -Ibuild/src.linux-x86_64-2.7/numpy/core/src/private -c'
    gcc: numpy/core/src/multiarray/compiled_base.c
    gcc: numpy/core/src/multiarray/sequence.c
    gcc: numpy/core/src/multiarray/descriptor.c
    gcc: numpy/core/src/multiarray/getset.c
    gcc: numpy/core/src/multiarray/arrayobject.c
    gcc: numpy/core/src/multiarray/methods.c
    gcc: numpy/core/src/multiarray/datetime_busdaycal.c
    gcc: numpy/core/src/multiarray/vdot.c
    gcc: numpy/core/src/multiarray/array_assign_array.c
    gcc: numpy/core/src/multiarray/buffer.c
    gcc: numpy/core/src/multiarray/refcount.c
    gcc: numpy/core/src/multiarray/convert.c
    gcc: numpy/core/src/multiarray/shape.c
    gcc: numpy/core/src/multiarray/numpymemoryview.c
    gcc: build/src.linux-x86_64-2.7/numpy/core/src/multiarray/lowlevel_strided_loops.c
    gcc: numpy/core/src/multiarray/multiarraymodule.c
    gcc: numpy/core/src/multiarray/item_selection.c
    gcc: numpy/core/src/multiarray/usertypes.c
    gcc: build/src.linux-x86_64-2.7/numpy/core/src/multiarray/arraytypes.c
    gcc: numpy/core/src/multiarray/calculation.c
    gcc: numpy/core/src/multiarray/hashdescr.c
    gcc: numpy/core/src/multiarray/scalarapi.c
    gcc: numpy/core/src/multiarray/dtype_transfer.c
    gcc: numpy/core/src/multiarray/mapping.c
    gcc: numpy/core/src/multiarray/flagsobject.c
    gcc: numpy/core/src/multiarray/nditer_constr.c
    gcc: numpy/core/src/multiarray/convert_datatype.c
    gcc: numpy/core/src/multiarray/array_assign_scalar.c
    gcc: numpy/core/src/multiarray/conversion_utils.c
    gcc: numpy/core/src/multiarray/common.c
    gcc: build/src.linux-x86_64-2.7/numpy/core/src/multiarray/nditer_templ.c
    gcc: numpy/core/src/multiarray/ucsnarrow.c
    gcc: build/src.linux-x86_64-2.7/numpy/core/src/multiarray/einsum.c
    gcc: numpy/core/src/multiarray/number.c
    gcc: numpy/core/src/multiarray/numpyos.c
    gcc: numpy/core/src/multiarray/datetime.c
    gcc: numpy/core/src/multiarray/datetime_strings.c
    gcc: numpy/core/src/multiarray/ctors.c
    gcc: numpy/core/src/multiarray/nditer_api.c
    gcc: numpy/core/src/multiarray/iterators.c
    gcc: build/src.linux-x86_64-2.7/numpy/core/src/multiarray/scalartypes.c
    gcc: numpy/core/src/private/mem_overlap.c
    In file included from /usr/include/python2.7/Python.h:8:0,
                     from numpy/core/src/private/mem_overlap.c:187:
    /usr/include/python2.7/pyconfig.h:1185:0: warning: "_POSIX_C_SOURCE" redefined [enabled by default]
     #define _POSIX_C_SOURCE 200112L
     ^
    In file included from /usr/include/stdlib.h:24:0,
                     from numpy/core/src/private/mem_overlap.c:184:
    /usr/include/features.h:230:0: note: this is the location of the previous definition
     # define _POSIX_C_SOURCE 200809L
     ^
    gcc: numpy/core/src/multiarray/array_assign.c
    gcc: numpy/core/src/multiarray/nditer_pywrap.c
    gcc: numpy/core/src/multiarray/datetime_busday.c
    gcc: numpy/core/src/multiarray/alloc.c
    gcc -pthread -shared build/temp.linux-x86_64-2.7/numpy/core/src/multiarray/alloc.o build/temp.linux-x86_64-2.7/numpy/core/src/multiarray/arrayobject.o build/temp.linux-x86_64-2.7/build/src.linux-x86_64-2.7/numpy/core/src/multiarray/arraytypes.o build/temp.linux-x86_64-2.7/numpy/core/src/multiarray/array_assign.o build/temp.linux-x86_64-2.7/numpy/core/src/multiarray/array_assign_scalar.o build/temp.linux-x86_64-2.7/numpy/core/src/multiarray/array_assign_array.o build/temp.linux-x86_64-2.7/numpy/core/src/multiarray/buffer.o build/temp.linux-x86_64-2.7/numpy/core/src/multiarray/calculation.o build/temp.linux-x86_64-2.7/numpy/core/src/multiarray/compiled_base.o build/temp.linux-x86_64-2.7/numpy/core/src/multiarray/common.o build/temp.linux-x86_64-2.7/numpy/core/src/multiarray/convert.o build/temp.linux-x86_64-2.7/numpy/core/src/multiarray/convert_datatype.o build/temp.linux-x86_64-2.7/numpy/core/src/multiarray/conversion_utils.o build/temp.linux-x86_64-2.7/numpy/core/src/multiarray/ctors.o build/temp.linux-x86_64-2.7/numpy/core/src/multiarray/datetime.o build/temp.linux-x86_64-2.7/numpy/core/src/multiarray/datetime_strings.o build/temp.linux-x86_64-2.7/numpy/core/src/multiarray/datetime_busday.o build/temp.linux-x86_64-2.7/numpy/core/src/multiarray/datetime_busdaycal.o build/temp.linux-x86_64-2.7/numpy/core/src/multiarray/descriptor.o build/temp.linux-x86_64-2.7/numpy/core/src/multiarray/dtype_transfer.o build/temp.linux-x86_64-2.7/build/src.linux-x86_64-2.7/numpy/core/src/multiarray/einsum.o build/temp.linux-x86_64-2.7/numpy/core/src/multiarray/flagsobject.o build/temp.linux-x86_64-2.7/numpy/core/src/multiarray/getset.o build/temp.linux-x86_64-2.7/numpy/core/src/multiarray/hashdescr.o build/temp.linux-x86_64-2.7/numpy/core/src/multiarray/item_selection.o build/temp.linux-x86_64-2.7/numpy/core/src/multiarray/iterators.o build/temp.linux-x86_64-2.7/build/src.linux-x86_64-2.7/numpy/core/src/multiarray/lowlevel_strided_loops.o build/temp.linux-x86_64-2.7/numpy/core/src/multiarray/mapping.o build/temp.linux-x86_64-2.7/numpy/core/src/multiarray/methods.o build/temp.linux-x86_64-2.7/numpy/core/src/multiarray/multiarraymodule.o build/temp.linux-x86_64-2.7/build/src.linux-x86_64-2.7/numpy/core/src/multiarray/nditer_templ.o build/temp.linux-x86_64-2.7/numpy/core/src/multiarray/nditer_api.o build/temp.linux-x86_64-2.7/numpy/core/src/multiarray/nditer_constr.o build/temp.linux-x86_64-2.7/numpy/core/src/multiarray/nditer_pywrap.o build/temp.linux-x86_64-2.7/numpy/core/src/multiarray/number.o build/temp.linux-x86_64-2.7/numpy/core/src/multiarray/numpymemoryview.o build/temp.linux-x86_64-2.7/numpy/core/src/multiarray/numpyos.o build/temp.linux-x86_64-2.7/numpy/core/src/multiarray/refcount.o build/temp.linux-x86_64-2.7/numpy/core/src/multiarray/sequence.o build/temp.linux-x86_64-2.7/numpy/core/src/multiarray/shape.o build/temp.linux-x86_64-2.7/numpy/core/src/multiarray/scalarapi.o build/temp.linux-x86_64-2.7/build/src.linux-x86_64-2.7/numpy/core/src/multiarray/scalartypes.o build/temp.linux-x86_64-2.7/numpy/core/src/multiarray/usertypes.o build/temp.linux-x86_64-2.7/numpy/core/src/multiarray/ucsnarrow.o build/temp.linux-x86_64-2.7/numpy/core/src/multiarray/vdot.o build/temp.linux-x86_64-2.7/numpy/core/src/private/mem_overlap.o -L/usr/lib64 -Lbuild/temp.linux-x86_64-2.7 -lnpymath -lnpysort -lm -lpython2.7 -o build/lib.linux-x86_64-2.7/numpy/core/multiarray.so
    building 'numpy.core.umath' extension
    compiling C sources
    C compiler: gcc -pthread -fno-strict-aliasing -fmessage-length=0 -grecord-gcc-switches -O2 -Wall -D_FORTIFY_SOURCE=2 -fstack-protector -funwind-tables -fasynchronous-unwind-tables -g -DNDEBUG -fmessage-length=0 -grecord-gcc-switches -O2 -Wall -D_FORTIFY_SOURCE=2 -fstack-protector -funwind-tables -fasynchronous-unwind-tables -g -DOPENSSL_LOAD_CONF -fPIC
    
    compile options: '-DHAVE_NPY_CONFIG_H=1 -D_FILE_OFFSET_BITS=64 -D_LARGEFILE_SOURCE=1 -D_LARGEFILE64_SOURCE=1 -Ibuild/src.linux-x86_64-2.7/numpy/core/src/umath -Inumpy/core/include -Ibuild/src.linux-x86_64-2.7/numpy/core/include/numpy -Inumpy/core/src/private -Inumpy/core/src -Inumpy/core -Inumpy/core/src/npymath -Inumpy/core/src/multiarray -Inumpy/core/src/umath -Inumpy/core/src/npysort -I/usr/include/python2.7 -Ibuild/src.linux-x86_64-2.7/numpy/core/src/private -Ibuild/src.linux-x86_64-2.7/numpy/core/src/private -Ibuild/src.linux-x86_64-2.7/numpy/core/src/private -c'
    gcc: numpy/core/src/umath/ufunc_type_resolution.c
    gcc: numpy/core/src/umath/ufunc_object.c
    gcc: build/src.linux-x86_64-2.7/numpy/core/src/umath/scalarmath.c
    gcc: build/src.linux-x86_64-2.7/numpy/core/src/umath/loops.c
    gcc: numpy/core/src/umath/umathmodule.c
    gcc: numpy/core/src/umath/reduction.c
    gcc -pthread -shared build/temp.linux-x86_64-2.7/numpy/core/src/umath/umathmodule.o build/temp.linux-x86_64-2.7/numpy/core/src/umath/reduction.o build/temp.linux-x86_64-2.7/build/src.linux-x86_64-2.7/numpy/core/src/umath/loops.o build/temp.linux-x86_64-2.7/numpy/core/src/umath/ufunc_object.o build/temp.linux-x86_64-2.7/build/src.linux-x86_64-2.7/numpy/core/src/umath/scalarmath.o build/temp.linux-x86_64-2.7/numpy/core/src/umath/ufunc_type_resolution.o -L/usr/lib64 -Lbuild/temp.linux-x86_64-2.7 -lnpymath -lm -lpython2.7 -o build/lib.linux-x86_64-2.7/numpy/core/umath.so
    building 'numpy.core.umath_tests' extension
    compiling C sources
    C compiler: gcc -pthread -fno-strict-aliasing -fmessage-length=0 -grecord-gcc-switches -O2 -Wall -D_FORTIFY_SOURCE=2 -fstack-protector -funwind-tables -fasynchronous-unwind-tables -g -DNDEBUG -fmessage-length=0 -grecord-gcc-switches -O2 -Wall -D_FORTIFY_SOURCE=2 -fstack-protector -funwind-tables -fasynchronous-unwind-tables -g -DOPENSSL_LOAD_CONF -fPIC
    
    compile options: '-DHAVE_NPY_CONFIG_H=1 -D_FILE_OFFSET_BITS=64 -D_LARGEFILE_SOURCE=1 -D_LARGEFILE64_SOURCE=1 -Inumpy/core/include -Ibuild/src.linux-x86_64-2.7/numpy/core/include/numpy -Inumpy/core/src/private -Inumpy/core/src -Inumpy/core -Inumpy/core/src/npymath -Inumpy/core/src/multiarray -Inumpy/core/src/umath -Inumpy/core/src/npysort -I/usr/include/python2.7 -Ibuild/src.linux-x86_64-2.7/numpy/core/src/private -Ibuild/src.linux-x86_64-2.7/numpy/core/src/private -Ibuild/src.linux-x86_64-2.7/numpy/core/src/private -c'
    gcc: build/src.linux-x86_64-2.7/numpy/core/src/umath/umath_tests.c
    gcc -pthread -shared build/temp.linux-x86_64-2.7/build/src.linux-x86_64-2.7/numpy/core/src/umath/umath_tests.o -L/usr/lib64 -Lbuild/temp.linux-x86_64-2.7 -lpython2.7 -o build/lib.linux-x86_64-2.7/numpy/core/umath_tests.so
    building 'numpy.core.test_rational' extension
    compiling C sources
    C compiler: gcc -pthread -fno-strict-aliasing -fmessage-length=0 -grecord-gcc-switches -O2 -Wall -D_FORTIFY_SOURCE=2 -fstack-protector -funwind-tables -fasynchronous-unwind-tables -g -DNDEBUG -fmessage-length=0 -grecord-gcc-switches -O2 -Wall -D_FORTIFY_SOURCE=2 -fstack-protector -funwind-tables -fasynchronous-unwind-tables -g -DOPENSSL_LOAD_CONF -fPIC
    
    compile options: '-DHAVE_NPY_CONFIG_H=1 -D_FILE_OFFSET_BITS=64 -D_LARGEFILE_SOURCE=1 -D_LARGEFILE64_SOURCE=1 -Inumpy/core/include -Ibuild/src.linux-x86_64-2.7/numpy/core/include/numpy -Inumpy/core/src/private -Inumpy/core/src -Inumpy/core -Inumpy/core/src/npymath -Inumpy/core/src/multiarray -Inumpy/core/src/umath -Inumpy/core/src/npysort -I/usr/include/python2.7 -Ibuild/src.linux-x86_64-2.7/numpy/core/src/private -Ibuild/src.linux-x86_64-2.7/numpy/core/src/private -Ibuild/src.linux-x86_64-2.7/numpy/core/src/private -c'
    gcc: build/src.linux-x86_64-2.7/numpy/core/src/umath/test_rational.c
    gcc -pthread -shared build/temp.linux-x86_64-2.7/build/src.linux-x86_64-2.7/numpy/core/src/umath/test_rational.o -L/usr/lib64 -Lbuild/temp.linux-x86_64-2.7 -lpython2.7 -o build/lib.linux-x86_64-2.7/numpy/core/test_rational.so
    building 'numpy.core.struct_ufunc_test' extension
    compiling C sources
    C compiler: gcc -pthread -fno-strict-aliasing -fmessage-length=0 -grecord-gcc-switches -O2 -Wall -D_FORTIFY_SOURCE=2 -fstack-protector -funwind-tables -fasynchronous-unwind-tables -g -DNDEBUG -fmessage-length=0 -grecord-gcc-switches -O2 -Wall -D_FORTIFY_SOURCE=2 -fstack-protector -funwind-tables -fasynchronous-unwind-tables -g -DOPENSSL_LOAD_CONF -fPIC
    
    compile options: '-DHAVE_NPY_CONFIG_H=1 -D_FILE_OFFSET_BITS=64 -D_LARGEFILE_SOURCE=1 -D_LARGEFILE64_SOURCE=1 -Inumpy/core/include -Ibuild/src.linux-x86_64-2.7/numpy/core/include/numpy -Inumpy/core/src/private -Inumpy/core/src -Inumpy/core -Inumpy/core/src/npymath -Inumpy/core/src/multiarray -Inumpy/core/src/umath -Inumpy/core/src/npysort -I/usr/include/python2.7 -Ibuild/src.linux-x86_64-2.7/numpy/core/src/private -Ibuild/src.linux-x86_64-2.7/numpy/core/src/private -Ibuild/src.linux-x86_64-2.7/numpy/core/src/private -c'
    gcc: build/src.linux-x86_64-2.7/numpy/core/src/umath/struct_ufunc_test.c
    gcc -pthread -shared build/temp.linux-x86_64-2.7/build/src.linux-x86_64-2.7/numpy/core/src/umath/struct_ufunc_test.o -L/usr/lib64 -Lbuild/temp.linux-x86_64-2.7 -lpython2.7 -o build/lib.linux-x86_64-2.7/numpy/core/struct_ufunc_test.so
    building 'numpy.core.multiarray_tests' extension
    compiling C sources
    C compiler: gcc -pthread -fno-strict-aliasing -fmessage-length=0 -grecord-gcc-switches -O2 -Wall -D_FORTIFY_SOURCE=2 -fstack-protector -funwind-tables -fasynchronous-unwind-tables -g -DNDEBUG -fmessage-length=0 -grecord-gcc-switches -O2 -Wall -D_FORTIFY_SOURCE=2 -fstack-protector -funwind-tables -fasynchronous-unwind-tables -g -DOPENSSL_LOAD_CONF -fPIC
    
    compile options: '-DHAVE_NPY_CONFIG_H=1 -D_FILE_OFFSET_BITS=64 -D_LARGEFILE_SOURCE=1 -D_LARGEFILE64_SOURCE=1 -Inumpy/core/include -Ibuild/src.linux-x86_64-2.7/numpy/core/include/numpy -Inumpy/core/src/private -Inumpy/core/src -Inumpy/core -Inumpy/core/src/npymath -Inumpy/core/src/multiarray -Inumpy/core/src/umath -Inumpy/core/src/npysort -I/usr/include/python2.7 -Ibuild/src.linux-x86_64-2.7/numpy/core/src/private -Ibuild/src.linux-x86_64-2.7/numpy/core/src/private -Ibuild/src.linux-x86_64-2.7/numpy/core/src/private -c'
    gcc: numpy/core/src/private/mem_overlap.c
    In file included from /usr/include/python2.7/Python.h:8:0,
                     from numpy/core/src/private/mem_overlap.c:187:
    /usr/include/python2.7/pyconfig.h:1185:0: warning: "_POSIX_C_SOURCE" redefined [enabled by default]
     #define _POSIX_C_SOURCE 200112L
     ^
    In file included from /usr/include/stdlib.h:24:0,
                     from numpy/core/src/private/mem_overlap.c:184:
    /usr/include/features.h:230:0: note: this is the location of the previous definition
     # define _POSIX_C_SOURCE 200809L
     ^
    gcc: build/src.linux-x86_64-2.7/numpy/core/src/multiarray/multiarray_tests.c
    gcc -pthread -shared build/temp.linux-x86_64-2.7/build/src.linux-x86_64-2.7/numpy/core/src/multiarray/multiarray_tests.o build/temp.linux-x86_64-2.7/numpy/core/src/private/mem_overlap.o -L/usr/lib64 -Lbuild/temp.linux-x86_64-2.7 -lpython2.7 -o build/lib.linux-x86_64-2.7/numpy/core/multiarray_tests.so
    building 'numpy.core.operand_flag_tests' extension
    compiling C sources
    C compiler: gcc -pthread -fno-strict-aliasing -fmessage-length=0 -grecord-gcc-switches -O2 -Wall -D_FORTIFY_SOURCE=2 -fstack-protector -funwind-tables -fasynchronous-unwind-tables -g -DNDEBUG -fmessage-length=0 -grecord-gcc-switches -O2 -Wall -D_FORTIFY_SOURCE=2 -fstack-protector -funwind-tables -fasynchronous-unwind-tables -g -DOPENSSL_LOAD_CONF -fPIC
    
    compile options: '-DHAVE_NPY_CONFIG_H=1 -D_FILE_OFFSET_BITS=64 -D_LARGEFILE_SOURCE=1 -D_LARGEFILE64_SOURCE=1 -Inumpy/core/include -Ibuild/src.linux-x86_64-2.7/numpy/core/include/numpy -Inumpy/core/src/private -Inumpy/core/src -Inumpy/core -Inumpy/core/src/npymath -Inumpy/core/src/multiarray -Inumpy/core/src/umath -Inumpy/core/src/npysort -I/usr/include/python2.7 -Ibuild/src.linux-x86_64-2.7/numpy/core/src/private -Ibuild/src.linux-x86_64-2.7/numpy/core/src/private -Ibuild/src.linux-x86_64-2.7/numpy/core/src/private -c'
    gcc: build/src.linux-x86_64-2.7/numpy/core/src/umath/operand_flag_tests.c
    gcc -pthread -shared build/temp.linux-x86_64-2.7/build/src.linux-x86_64-2.7/numpy/core/src/umath/operand_flag_tests.o -L/usr/lib64 -Lbuild/temp.linux-x86_64-2.7 -lpython2.7 -o build/lib.linux-x86_64-2.7/numpy/core/operand_flag_tests.so
    building 'numpy.fft.fftpack_lite' extension
    compiling C sources
    C compiler: gcc -pthread -fno-strict-aliasing -fmessage-length=0 -grecord-gcc-switches -O2 -Wall -D_FORTIFY_SOURCE=2 -fstack-protector -funwind-tables -fasynchronous-unwind-tables -g -DNDEBUG -fmessage-length=0 -grecord-gcc-switches -O2 -Wall -D_FORTIFY_SOURCE=2 -fstack-protector -funwind-tables -fasynchronous-unwind-tables -g -DOPENSSL_LOAD_CONF -fPIC
    
    compile options: '-Inumpy/core/include -Ibuild/src.linux-x86_64-2.7/numpy/core/include/numpy -Inumpy/core/src/private -Inumpy/core/src -Inumpy/core -Inumpy/core/src/npymath -Inumpy/core/src/multiarray -Inumpy/core/src/umath -Inumpy/core/src/npysort -I/usr/include/python2.7 -Ibuild/src.linux-x86_64-2.7/numpy/core/src/private -Ibuild/src.linux-x86_64-2.7/numpy/core/src/private -Ibuild/src.linux-x86_64-2.7/numpy/core/src/private -c'
    gcc: numpy/fft/fftpack.c
    gcc: numpy/fft/fftpack_litemodule.c
    gcc -pthread -shared build/temp.linux-x86_64-2.7/numpy/fft/fftpack_litemodule.o build/temp.linux-x86_64-2.7/numpy/fft/fftpack.o -L/usr/lib64 -Lbuild/temp.linux-x86_64-2.7 -lpython2.7 -o build/lib.linux-x86_64-2.7/numpy/fft/fftpack_lite.so
    building 'numpy.linalg.lapack_lite' extension
    compiling C sources
    C compiler: gcc -pthread -fno-strict-aliasing -fmessage-length=0 -grecord-gcc-switches -O2 -Wall -D_FORTIFY_SOURCE=2 -fstack-protector -funwind-tables -fasynchronous-unwind-tables -g -DNDEBUG -fmessage-length=0 -grecord-gcc-switches -O2 -Wall -D_FORTIFY_SOURCE=2 -fstack-protector -funwind-tables -fasynchronous-unwind-tables -g -DOPENSSL_LOAD_CONF -fPIC
    
    compile options: '-DNO_ATLAS_INFO=1 -Inumpy/core/include -Ibuild/src.linux-x86_64-2.7/numpy/core/include/numpy -Inumpy/core/src/private -Inumpy/core/src -Inumpy/core -Inumpy/core/src/npymath -Inumpy/core/src/multiarray -Inumpy/core/src/umath -Inumpy/core/src/npysort -I/usr/include/python2.7 -Ibuild/src.linux-x86_64-2.7/numpy/core/src/private -Ibuild/src.linux-x86_64-2.7/numpy/core/src/private -Ibuild/src.linux-x86_64-2.7/numpy/core/src/private -c'
    gcc: numpy/linalg/lapack_litemodule.c
    gcc: numpy/linalg/lapack_lite/python_xerbla.c
    /usr/bin/gfortran -Wall -g -Wall -g -shared build/temp.linux-x86_64-2.7/numpy/linalg/lapack_litemodule.o build/temp.linux-x86_64-2.7/numpy/linalg/lapack_lite/python_xerbla.o -L/usr/lib64 -L/usr/lib64 -Lbuild/temp.linux-x86_64-2.7 -llapack -llapack -lblas -lblas -lpython2.7 -lgfortran -o build/lib.linux-x86_64-2.7/numpy/linalg/lapack_lite.so
    building 'numpy.linalg._umath_linalg' extension
    compiling C sources
    C compiler: gcc -pthread -fno-strict-aliasing -fmessage-length=0 -grecord-gcc-switches -O2 -Wall -D_FORTIFY_SOURCE=2 -fstack-protector -funwind-tables -fasynchronous-unwind-tables -g -DNDEBUG -fmessage-length=0 -grecord-gcc-switches -O2 -Wall -D_FORTIFY_SOURCE=2 -fstack-protector -funwind-tables -fasynchronous-unwind-tables -g -DOPENSSL_LOAD_CONF -fPIC
    
    compile options: '-DNO_ATLAS_INFO=1 -Inumpy/core/include -Ibuild/src.linux-x86_64-2.7/numpy/core/include/numpy -Inumpy/core/src/private -Inumpy/core/src -Inumpy/core -Inumpy/core/src/npymath -Inumpy/core/src/multiarray -Inumpy/core/src/umath -Inumpy/core/src/npysort -I/usr/include/python2.7 -Ibuild/src.linux-x86_64-2.7/numpy/core/src/private -Ibuild/src.linux-x86_64-2.7/numpy/core/src/private -Ibuild/src.linux-x86_64-2.7/numpy/core/src/private -c'
    gcc: numpy/linalg/lapack_lite/python_xerbla.c
    gcc: build/src.linux-x86_64-2.7/numpy/linalg/umath_linalg.c
    /usr/bin/gfortran -Wall -g -Wall -g -shared build/temp.linux-x86_64-2.7/build/src.linux-x86_64-2.7/numpy/linalg/umath_linalg.o build/temp.linux-x86_64-2.7/numpy/linalg/lapack_lite/python_xerbla.o -L/usr/lib64 -L/usr/lib64 -Lbuild/temp.linux-x86_64-2.7 -lnpymath -llapack -llapack -lblas -lblas -lpython2.7 -lgfortran -o build/lib.linux-x86_64-2.7/numpy/linalg/_umath_linalg.so
    building 'numpy.random.mtrand' extension
    compiling C sources
    C compiler: gcc -pthread -fno-strict-aliasing -fmessage-length=0 -grecord-gcc-switches -O2 -Wall -D_FORTIFY_SOURCE=2 -fstack-protector -funwind-tables -fasynchronous-unwind-tables -g -DNDEBUG -fmessage-length=0 -grecord-gcc-switches -O2 -Wall -D_FORTIFY_SOURCE=2 -fstack-protector -funwind-tables -fasynchronous-unwind-tables -g -DOPENSSL_LOAD_CONF -fPIC
    
    compile options: '-D_FILE_OFFSET_BITS=64 -D_LARGEFILE_SOURCE=1 -D_LARGEFILE64_SOURCE=1 -Inumpy/core/include -Ibuild/src.linux-x86_64-2.7/numpy/core/include/numpy -Inumpy/core/src/private -Inumpy/core/src -Inumpy/core -Inumpy/core/src/npymath -Inumpy/core/src/multiarray -Inumpy/core/src/umath -Inumpy/core/src/npysort -I/usr/include/python2.7 -Ibuild/src.linux-x86_64-2.7/numpy/core/src/private -Ibuild/src.linux-x86_64-2.7/numpy/core/src/private -Ibuild/src.linux-x86_64-2.7/numpy/core/src/private -c'
    gcc: numpy/random/mtrand/distributions.c
    In file included from /usr/include/python2.7/Python.h:8:0,
                     from numpy/core/include/numpy/npy_common.h:11,
                     from numpy/random/mtrand/randomkit.h:63,
                     from numpy/random/mtrand/distributions.h:26,
                     from numpy/random/mtrand/distributions.c:46:
    /usr/include/python2.7/pyconfig.h:1185:0: warning: "_POSIX_C_SOURCE" redefined [enabled by default]
     #define _POSIX_C_SOURCE 200112L
     ^
    In file included from /usr/include/math.h:26:0,
                     from numpy/random/mtrand/distributions.c:44:
    /usr/include/features.h:230:0: note: this is the location of the previous definition
     # define _POSIX_C_SOURCE 200809L
     ^
    gcc: numpy/random/mtrand/mtrand.c
    gcc: numpy/random/mtrand/initarray.c
    gcc: numpy/random/mtrand/randomkit.c
    In file included from /usr/include/python2.7/Python.h:8:0,
                     from numpy/core/include/numpy/npy_common.h:11,
                     from numpy/random/mtrand/randomkit.h:63,
                     from numpy/random/mtrand/randomkit.c:123:
    /usr/include/python2.7/pyconfig.h:1185:0: warning: "_POSIX_C_SOURCE" redefined [enabled by default]
     #define _POSIX_C_SOURCE 200112L
     ^
    In file included from /usr/include/stdio.h:27:0,
                     from numpy/random/mtrand/randomkit.c:68:
    /usr/include/features.h:230:0: note: this is the location of the previous definition
     # define _POSIX_C_SOURCE 200809L
     ^
    gcc -pthread -shared build/temp.linux-x86_64-2.7/numpy/random/mtrand/mtrand.o build/temp.linux-x86_64-2.7/numpy/random/mtrand/randomkit.o build/temp.linux-x86_64-2.7/numpy/random/mtrand/initarray.o build/temp.linux-x86_64-2.7/numpy/random/mtrand/distributions.o -L/usr/lib64 -Lbuild/temp.linux-x86_64-2.7 -lpython2.7 -o build/lib.linux-x86_64-2.7/numpy/random/mtrand.so
    Creating build/scripts.linux-x86_64-2.7/f2py
      adding 'build/scripts.linux-x86_64-2.7/f2py' to scripts
    changing mode of build/scripts.linux-x86_64-2.7/f2py from 644 to 755
    
    warning: no previously-included files matching '*.pyo' found anywhere in distribution
    warning: no previously-included files matching '*.pyd' found anywhere in distribution
    changing mode of /home/ivan/test/bin/f2py to 755
  Running setup.py install for ZODB3
    
    warning: no files found matching '*.rst'
  Running setup.py install for psutil
    building 'psutil._psutil_linux' extension
    gcc -pthread -fno-strict-aliasing -fmessage-length=0 -grecord-gcc-switches -O2 -Wall -D_FORTIFY_SOURCE=2 -fstack-protector -funwind-tables -fasynchronous-unwind-tables -g -DNDEBUG -fmessage-length=0 -grecord-gcc-switches -O2 -Wall -D_FORTIFY_SOURCE=2 -fstack-protector -funwind-tables -fasynchronous-unwind-tables -g -DOPENSSL_LOAD_CONF -fPIC -DPSUTIL_VERSION=420 -I/usr/include/python2.7 -c psutil/_psutil_linux.c -o build/temp.linux-x86_64-2.7/psutil/_psutil_linux.o
    gcc -pthread -shared build/temp.linux-x86_64-2.7/psutil/_psutil_linux.o -L/usr/lib64 -lpython2.7 -o build/lib.linux-x86_64-2.7/psutil/_psutil_linux.so
    building 'psutil._psutil_posix' extension
    gcc -pthread -fno-strict-aliasing -fmessage-length=0 -grecord-gcc-switches -O2 -Wall -D_FORTIFY_SOURCE=2 -fstack-protector -funwind-tables -fasynchronous-unwind-tables -g -DNDEBUG -fmessage-length=0 -grecord-gcc-switches -O2 -Wall -D_FORTIFY_SOURCE=2 -fstack-protector -funwind-tables -fasynchronous-unwind-tables -g -DOPENSSL_LOAD_CONF -fPIC -I/usr/include/python2.7 -c psutil/_psutil_posix.c -o build/temp.linux-x86_64-2.7/psutil/_psutil_posix.o
    gcc -pthread -shared build/temp.linux-x86_64-2.7/psutil/_psutil_posix.o -L/usr/lib64 -lpython2.7 -o build/lib.linux-x86_64-2.7/psutil/_psutil_posix.so
    
    warning: no previously-included files matching '*' found under directory 'docs/_build'
  Running setup.py install for ZEO
    
    warning: no previously-included files matching '*.pyc' found anywhere in distribution
    Installing zeo-nagios script to /home/ivan/test/bin
    Installing runzeo script to /home/ivan/test/bin
    Installing zeoctl script to /home/ivan/test/bin
    Installing zeopack script to /home/ivan/test/bin
    Installing zeopasswd script to /home/ivan/test/bin
  Running setup.py install for ZODB
    
    warning: no previously-included files matching '*.dll' found anywhere in distribution
    warning: no previously-included files matching '*.pyc' found anywhere in distribution
    warning: no previously-included files matching '*.pyo' found anywhere in distribution
    warning: no previously-included files matching '*.so' found anywhere in distribution
    Installing fsdump script to /home/ivan/test/bin
    Installing repozo script to /home/ivan/test/bin
    Installing fsoids script to /home/ivan/test/bin
    Installing fstail script to /home/ivan/test/bin
    Installing fsrefs script to /home/ivan/test/bin
  Running setup.py install for persistent
    
    warning: no previously-included files matching '*.dll' found anywhere in distribution
    warning: no previously-included files matching '*.pyc' found anywhere in distribution
    warning: no previously-included files matching '*.pyo' found anywhere in distribution
    warning: no previously-included files matching '*.so' found anywhere in distribution
    warning: no previously-included files matching 'coverage.xml' found anywhere in distribution
    no previously-included directories found matching 'docs/_build'
    no previously-included directories found matching 'persistent/__pycache__'
    building 'persistent.cPersistence' extension
    gcc -pthread -fno-strict-aliasing -fmessage-length=0 -grecord-gcc-switches -O2 -Wall -D_FORTIFY_SOURCE=2 -fstack-protector -funwind-tables -fasynchronous-unwind-tables -g -DNDEBUG -fmessage-length=0 -grecord-gcc-switches -O2 -Wall -D_FORTIFY_SOURCE=2 -fstack-protector -funwind-tables -fasynchronous-unwind-tables -g -DOPENSSL_LOAD_CONF -fPIC -I/usr/include/python2.7 -c persistent/cPersistence.c -o build/temp.linux-x86_64-2.7/persistent/cPersistence.o
    gcc -pthread -fno-strict-aliasing -fmessage-length=0 -grecord-gcc-switches -O2 -Wall -D_FORTIFY_SOURCE=2 -fstack-protector -funwind-tables -fasynchronous-unwind-tables -g -DNDEBUG -fmessage-length=0 -grecord-gcc-switches -O2 -Wall -D_FORTIFY_SOURCE=2 -fstack-protector -funwind-tables -fasynchronous-unwind-tables -g -DOPENSSL_LOAD_CONF -fPIC -I/usr/include/python2.7 -c persistent/ring.c -o build/temp.linux-x86_64-2.7/persistent/ring.o
    gcc -pthread -shared build/temp.linux-x86_64-2.7/persistent/cPersistence.o build/temp.linux-x86_64-2.7/persistent/ring.o -L/usr/lib64 -lpython2.7 -o build/lib.linux-x86_64-2.7/persistent/cPersistence.so
    building 'persistent.cPickleCache' extension
    gcc -pthread -fno-strict-aliasing -fmessage-length=0 -grecord-gcc-switches -O2 -Wall -D_FORTIFY_SOURCE=2 -fstack-protector -funwind-tables -fasynchronous-unwind-tables -g -DNDEBUG -fmessage-length=0 -grecord-gcc-switches -O2 -Wall -D_FORTIFY_SOURCE=2 -fstack-protector -funwind-tables -fasynchronous-unwind-tables -g -DOPENSSL_LOAD_CONF -fPIC -I/usr/include/python2.7 -c persistent/cPickleCache.c -o build/temp.linux-x86_64-2.7/persistent/cPickleCache.o
    gcc -pthread -fno-strict-aliasing -fmessage-length=0 -grecord-gcc-switches -O2 -Wall -D_FORTIFY_SOURCE=2 -fstack-protector -funwind-tables -fasynchronous-unwind-tables -g -DNDEBUG -fmessage-length=0 -grecord-gcc-switches -O2 -Wall -D_FORTIFY_SOURCE=2 -fstack-protector -funwind-tables -fasynchronous-unwind-tables -g -DOPENSSL_LOAD_CONF -fPIC -I/usr/include/python2.7 -c persistent/ring.c -o build/temp.linux-x86_64-2.7/persistent/ring.o
    gcc -pthread -shared build/temp.linux-x86_64-2.7/persistent/cPickleCache.o build/temp.linux-x86_64-2.7/persistent/ring.o -L/usr/lib64 -lpython2.7 -o build/lib.linux-x86_64-2.7/persistent/cPickleCache.so
    building 'persistent._timestamp' extension
    gcc -pthread -fno-strict-aliasing -fmessage-length=0 -grecord-gcc-switches -O2 -Wall -D_FORTIFY_SOURCE=2 -fstack-protector -funwind-tables -fasynchronous-unwind-tables -g -DNDEBUG -fmessage-length=0 -grecord-gcc-switches -O2 -Wall -D_FORTIFY_SOURCE=2 -fstack-protector -funwind-tables -fasynchronous-unwind-tables -g -DOPENSSL_LOAD_CONF -fPIC -I/usr/include/python2.7 -c persistent/_timestamp.c -o build/temp.linux-x86_64-2.7/persistent/_timestamp.o
    gcc -pthread -shared build/temp.linux-x86_64-2.7/persistent/_timestamp.o -L/usr/lib64 -lpython2.7 -o build/lib.linux-x86_64-2.7/persistent/_timestamp.so
  Running setup.py install for BTrees
    
    warning: no previously-included files matching '*.dll' found anywhere in distribution
    warning: no previously-included files matching '*.pyc' found anywhere in distribution
    warning: no previously-included files matching '*.pyo' found anywhere in distribution
    warning: no previously-included files matching '*.so' found anywhere in distribution
    warning: no previously-included files matching 'coverage.xml' found anywhere in distribution
    no previously-included directories found matching 'docs/_build'
    building 'BTrees._OOBTree' extension
    gcc -pthread -fno-strict-aliasing -fmessage-length=0 -grecord-gcc-switches -O2 -Wall -D_FORTIFY_SOURCE=2 -fstack-protector -funwind-tables -fasynchronous-unwind-tables -g -DNDEBUG -fmessage-length=0 -grecord-gcc-switches -O2 -Wall -D_FORTIFY_SOURCE=2 -fstack-protector -funwind-tables -fasynchronous-unwind-tables -g -DOPENSSL_LOAD_CONF -fPIC -I/home/ivan/test/lib/python2.7/site-packages -I/usr/include/python2.7 -c BTrees/_OOBTree.c -o build/temp.linux-x86_64-2.7/BTrees/_OOBTree.o
    gcc -pthread -shared build/temp.linux-x86_64-2.7/BTrees/_OOBTree.o -L/usr/lib64 -lpython2.7 -o build/lib.linux-x86_64-2.7/BTrees/_OOBTree.so
    building 'BTrees._IOBTree' extension
    gcc -pthread -fno-strict-aliasing -fmessage-length=0 -grecord-gcc-switches -O2 -Wall -D_FORTIFY_SOURCE=2 -fstack-protector -funwind-tables -fasynchronous-unwind-tables -g -DNDEBUG -fmessage-length=0 -grecord-gcc-switches -O2 -Wall -D_FORTIFY_SOURCE=2 -fstack-protector -funwind-tables -fasynchronous-unwind-tables -g -DOPENSSL_LOAD_CONF -fPIC -DEXCLUDE_INTSET_SUPPORT -I/home/ivan/test/lib/python2.7/site-packages -I/usr/include/python2.7 -c BTrees/_IOBTree.c -o build/temp.linux-x86_64-2.7/BTrees/_IOBTree.o
    gcc -pthread -shared build/temp.linux-x86_64-2.7/BTrees/_IOBTree.o -L/usr/lib64 -lpython2.7 -o build/lib.linux-x86_64-2.7/BTrees/_IOBTree.so
    building 'BTrees._OIBTree' extension
    gcc -pthread -fno-strict-aliasing -fmessage-length=0 -grecord-gcc-switches -O2 -Wall -D_FORTIFY_SOURCE=2 -fstack-protector -funwind-tables -fasynchronous-unwind-tables -g -DNDEBUG -fmessage-length=0 -grecord-gcc-switches -O2 -Wall -D_FORTIFY_SOURCE=2 -fstack-protector -funwind-tables -fasynchronous-unwind-tables -g -DOPENSSL_LOAD_CONF -fPIC -I/home/ivan/test/lib/python2.7/site-packages -I/usr/include/python2.7 -c BTrees/_OIBTree.c -o build/temp.linux-x86_64-2.7/BTrees/_OIBTree.o
    gcc -pthread -shared build/temp.linux-x86_64-2.7/BTrees/_OIBTree.o -L/usr/lib64 -lpython2.7 -o build/lib.linux-x86_64-2.7/BTrees/_OIBTree.so
    building 'BTrees._IIBTree' extension
    gcc -pthread -fno-strict-aliasing -fmessage-length=0 -grecord-gcc-switches -O2 -Wall -D_FORTIFY_SOURCE=2 -fstack-protector -funwind-tables -fasynchronous-unwind-tables -g -DNDEBUG -fmessage-length=0 -grecord-gcc-switches -O2 -Wall -D_FORTIFY_SOURCE=2 -fstack-protector -funwind-tables -fasynchronous-unwind-tables -g -DOPENSSL_LOAD_CONF -fPIC -DEXCLUDE_INTSET_SUPPORT -I/home/ivan/test/lib/python2.7/site-packages -I/usr/include/python2.7 -c BTrees/_IIBTree.c -o build/temp.linux-x86_64-2.7/BTrees/_IIBTree.o
    gcc -pthread -shared build/temp.linux-x86_64-2.7/BTrees/_IIBTree.o -L/usr/lib64 -lpython2.7 -o build/lib.linux-x86_64-2.7/BTrees/_IIBTree.so
    building 'BTrees._IFBTree' extension
    gcc -pthread -fno-strict-aliasing -fmessage-length=0 -grecord-gcc-switches -O2 -Wall -D_FORTIFY_SOURCE=2 -fstack-protector -funwind-tables -fasynchronous-unwind-tables -g -DNDEBUG -fmessage-length=0 -grecord-gcc-switches -O2 -Wall -D_FORTIFY_SOURCE=2 -fstack-protector -funwind-tables -fasynchronous-unwind-tables -g -DOPENSSL_LOAD_CONF -fPIC -DEXCLUDE_INTSET_SUPPORT -I/home/ivan/test/lib/python2.7/site-packages -I/usr/include/python2.7 -c BTrees/_IFBTree.c -o build/temp.linux-x86_64-2.7/BTrees/_IFBTree.o
    gcc -pthread -shared build/temp.linux-x86_64-2.7/BTrees/_IFBTree.o -L/usr/lib64 -lpython2.7 -o build/lib.linux-x86_64-2.7/BTrees/_IFBTree.so
    building 'BTrees._fsBTree' extension
    gcc -pthread -fno-strict-aliasing -fmessage-length=0 -grecord-gcc-switches -O2 -Wall -D_FORTIFY_SOURCE=2 -fstack-protector -funwind-tables -fasynchronous-unwind-tables -g -DNDEBUG -fmessage-length=0 -grecord-gcc-switches -O2 -Wall -D_FORTIFY_SOURCE=2 -fstack-protector -funwind-tables -fasynchronous-unwind-tables -g -DOPENSSL_LOAD_CONF -fPIC -DEXCLUDE_INTSET_SUPPORT -I/home/ivan/test/lib/python2.7/site-packages -I/usr/include/python2.7 -c BTrees/_fsBTree.c -o build/temp.linux-x86_64-2.7/BTrees/_fsBTree.o
    gcc -pthread -shared build/temp.linux-x86_64-2.7/BTrees/_fsBTree.o -L/usr/lib64 -lpython2.7 -o build/lib.linux-x86_64-2.7/BTrees/_fsBTree.so
    building 'BTrees._LOBTree' extension
    gcc -pthread -fno-strict-aliasing -fmessage-length=0 -grecord-gcc-switches -O2 -Wall -D_FORTIFY_SOURCE=2 -fstack-protector -funwind-tables -fasynchronous-unwind-tables -g -DNDEBUG -fmessage-length=0 -grecord-gcc-switches -O2 -Wall -D_FORTIFY_SOURCE=2 -fstack-protector -funwind-tables -fasynchronous-unwind-tables -g -DOPENSSL_LOAD_CONF -fPIC -DEXCLUDE_INTSET_SUPPORT -I/home/ivan/test/lib/python2.7/site-packages -I/usr/include/python2.7 -c BTrees/_LOBTree.c -o build/temp.linux-x86_64-2.7/BTrees/_LOBTree.o
    gcc -pthread -shared build/temp.linux-x86_64-2.7/BTrees/_LOBTree.o -L/usr/lib64 -lpython2.7 -o build/lib.linux-x86_64-2.7/BTrees/_LOBTree.so
    building 'BTrees._OLBTree' extension
    gcc -pthread -fno-strict-aliasing -fmessage-length=0 -grecord-gcc-switches -O2 -Wall -D_FORTIFY_SOURCE=2 -fstack-protector -funwind-tables -fasynchronous-unwind-tables -g -DNDEBUG -fmessage-length=0 -grecord-gcc-switches -O2 -Wall -D_FORTIFY_SOURCE=2 -fstack-protector -funwind-tables -fasynchronous-unwind-tables -g -DOPENSSL_LOAD_CONF -fPIC -I/home/ivan/test/lib/python2.7/site-packages -I/usr/include/python2.7 -c BTrees/_OLBTree.c -o build/temp.linux-x86_64-2.7/BTrees/_OLBTree.o
    gcc -pthread -shared build/temp.linux-x86_64-2.7/BTrees/_OLBTree.o -L/usr/lib64 -lpython2.7 -o build/lib.linux-x86_64-2.7/BTrees/_OLBTree.so
    building 'BTrees._LLBTree' extension
    gcc -pthread -fno-strict-aliasing -fmessage-length=0 -grecord-gcc-switches -O2 -Wall -D_FORTIFY_SOURCE=2 -fstack-protector -funwind-tables -fasynchronous-unwind-tables -g -DNDEBUG -fmessage-length=0 -grecord-gcc-switches -O2 -Wall -D_FORTIFY_SOURCE=2 -fstack-protector -funwind-tables -fasynchronous-unwind-tables -g -DOPENSSL_LOAD_CONF -fPIC -DEXCLUDE_INTSET_SUPPORT -I/home/ivan/test/lib/python2.7/site-packages -I/usr/include/python2.7 -c BTrees/_LLBTree.c -o build/temp.linux-x86_64-2.7/BTrees/_LLBTree.o
    gcc -pthread -shared build/temp.linux-x86_64-2.7/BTrees/_LLBTree.o -L/usr/lib64 -lpython2.7 -o build/lib.linux-x86_64-2.7/BTrees/_LLBTree.so
    building 'BTrees._LFBTree' extension
    gcc -pthread -fno-strict-aliasing -fmessage-length=0 -grecord-gcc-switches -O2 -Wall -D_FORTIFY_SOURCE=2 -fstack-protector -funwind-tables -fasynchronous-unwind-tables -g -DNDEBUG -fmessage-length=0 -grecord-gcc-switches -O2 -Wall -D_FORTIFY_SOURCE=2 -fstack-protector -funwind-tables -fasynchronous-unwind-tables -g -DOPENSSL_LOAD_CONF -fPIC -DEXCLUDE_INTSET_SUPPORT -I/home/ivan/test/lib/python2.7/site-packages -I/usr/include/python2.7 -c BTrees/_LFBTree.c -o build/temp.linux-x86_64-2.7/BTrees/_LFBTree.o
    gcc -pthread -shared build/temp.linux-x86_64-2.7/BTrees/_LFBTree.o -L/usr/lib64 -lpython2.7 -o build/lib.linux-x86_64-2.7/BTrees/_LFBTree.so
  Running setup.py install for transaction
    
    warning: no previously-included files matching '*.dll' found anywhere in distribution
    warning: no previously-included files matching '*.pyc' found anywhere in distribution
    warning: no previously-included files matching '*.pyo' found anywhere in distribution
    warning: no previously-included files matching '*.so' found anywhere in distribution
    warning: no previously-included files matching 'coverage.xml' found anywhere in distribution
    no previously-included directories found matching 'docs/_build'
  Running setup.py install for zc.lockfile
    
    warning: no files found matching '*.rst'
    warning: no previously-included files matching '*.pyc' found anywhere in distribution
    Skipping installation of /home/ivan/test/lib/python2.7/site-packages/zc/__init__.py (namespace package)
    Installing /home/ivan/test/lib/python2.7/site-packages/zc.lockfile-1.2.0-py2.7-nspkg.pth
  Running setup.py install for ZConfig
    
    warning: no files found matching '*.rst'
    warning: no previously-included files matching '*.pyc' found anywhere in distribution
    changing mode of build/scripts-2.7/zconfig from 644 to 755
    changing mode of build/scripts-2.7/zconfig_schema2html from 644 to 755
    changing mode of /home/ivan/test/bin/zconfig_schema2html to 755
    changing mode of /home/ivan/test/bin/zconfig to 755
  Running setup.py install for zdaemon
    
    warning: no previously-included files matching '*.pyc' found anywhere in distribution
    Installing zdaemon script to /home/ivan/test/bin
  Running setup.py install for zope.interface
    
    warning: no previously-included files matching '*.dll' found anywhere in distribution
    warning: no previously-included files matching '*.pyc' found anywhere in distribution
    warning: no previously-included files matching '*.pyo' found anywhere in distribution
    warning: no previously-included files matching '*.so' found anywhere in distribution
    warning: no previously-included files matching 'coverage.xml' found anywhere in distribution
    no previously-included directories found matching 'docs/_build'
    building 'zope.interface._zope_interface_coptimizations' extension
    gcc -pthread -fno-strict-aliasing -fmessage-length=0 -grecord-gcc-switches -O2 -Wall -D_FORTIFY_SOURCE=2 -fstack-protector -funwind-tables -fasynchronous-unwind-tables -g -DNDEBUG -fmessage-length=0 -grecord-gcc-switches -O2 -Wall -D_FORTIFY_SOURCE=2 -fstack-protector -funwind-tables -fasynchronous-unwind-tables -g -DOPENSSL_LOAD_CONF -fPIC -I/usr/include/python2.7 -c src/zope/interface/_zope_interface_coptimizations.c -o build/temp.linux-x86_64-2.7/src/zope/interface/_zope_interface_coptimizations.o
    gcc -pthread -shared build/temp.linux-x86_64-2.7/src/zope/interface/_zope_interface_coptimizations.o -L/usr/lib64 -lpython2.7 -o build/lib.linux-x86_64-2.7/zope/interface/_zope_interface_coptimizations.so
    Skipping installation of /home/ivan/test/lib64/python2.7/site-packages/zope/__init__.py (namespace package)
    Installing /home/ivan/test/lib64/python2.7/site-packages/zope.interface-4.2.0-py2.7-nspkg.pth
  Running setup.py install for zodbpickle
    
    warning: no previously-included files matching '*.dll' found anywhere in distribution
    warning: no previously-included files matching '*.pyc' found anywhere in distribution
    warning: no previously-included files matching '*.pyo' found anywhere in distribution
    warning: no previously-included files matching '*.so' found anywhere in distribution
    building 'zodbpickle._pickle' extension
    gcc -pthread -fno-strict-aliasing -fmessage-length=0 -grecord-gcc-switches -O2 -Wall -D_FORTIFY_SOURCE=2 -fstack-protector -funwind-tables -fasynchronous-unwind-tables -g -DNDEBUG -fmessage-length=0 -grecord-gcc-switches -O2 -Wall -D_FORTIFY_SOURCE=2 -fstack-protector -funwind-tables -fasynchronous-unwind-tables -g -DOPENSSL_LOAD_CONF -fPIC -I/usr/include/python2.7 -c src/zodbpickle/_pickle_27.c -o build/temp.linux-x86_64-2.7/src/zodbpickle/_pickle_27.o
    gcc -pthread -shared build/temp.linux-x86_64-2.7/src/zodbpickle/_pickle_27.o -L/usr/lib64 -lpython2.7 -o build/lib.linux-x86_64-2.7/zodbpickle/_pickle.so
      File "/home/ivan/test/lib64/python2.7/site-packages/zodbpickle/tests/pickletester_3.py", line 145
        class use_metaclass(object, metaclass=metaclass):
                                             ^
    SyntaxError: invalid syntax
    
      File "/home/ivan/test/lib64/python2.7/site-packages/zodbpickle/pickle_3.py", line 178
        def __init__(self, file, protocol=None, *, fix_imports=True):
                                                 ^
    SyntaxError: invalid syntax
    
      File "/home/ivan/test/lib64/python2.7/site-packages/zodbpickle/pickletools_3.py", line 2049
        print("%5d:" % pos, end=' ', file=out)
                               ^
    SyntaxError: invalid syntax
    
Successfully installed wendelin.core numpy ZODB3 six psutil ZEO ZODB persistent BTrees transaction zc.lockfile ZConfig zdaemon zope.interface zodbpickle
Cleaning up...
(test)ivan@l540:~>